The following warnings occurred:
Warning [2] count(): Parameter must be an array or an object that implements Countable - Line: 895 - File: showthread.php PHP 7.2.34 (Linux)
File Line Function
/showthread.php 895 errorHandler->error




Thread Rating:
  • 0 Vote(s) - 0 Average
  • 1
  • 2
  • 3
  • 4
  • 5
Como instalar Vdrift en Ubuntu 10.04??
09-23-2010, 10:27 AM,
#1
Como instalar Vdrift en Ubuntu 10.04??
He estado mirando los posts en el foro e intentando hacer lo que dicen paso a paso pero cuando ejecuto el comando scons me da un error y quisiera ver la posibilidad de que me ayuden un poco con esto. El error en cuestion es el siguiente:

johannlp@kamy:~/vdrift-2009-02-15$ scons
scons: Reading SConscript files ...

scons: warning: The Options class is deprecated; use the Variables class instead.
File "/home/johannlp/vdrift-2009-02-15/SConstruct", line 9, in <module>

scons: warning: The BoolOption() function is deprecated; use the BoolVariable() function instead.
File "/home/johannlp/vdrift-2009-02-15/SConstruct", line 13, in <module>
Checking for C++ header file GL/gl.h... (cached) yes
Checking for C++ header file GL/glu.h... (cached) yes
Checking for C++ header file SDL/SDL.h... (cached) yes
Checking for C++ header file SDL/SDL_image.h... (cached) yes
Checking for C++ header file SDL/SDL_net.h... (cached) yes
Checking for C++ header file SDL/SDL_rotozoom.h... (cached) yes
Checking for C++ header file vorbis/vorbisfile.h... (cached) yes
Checking for C++ header file GL/glew.h... (cached) yes
sh: svnversion: not found
scons: done reading SConscript files.
scons: Building targets ...
g++ -o build/ai.o -c -Wall -Wextra -Wno-unused-parameter -O1 -pipe -D_GNU_SOURCE=1 -D_REENTRANT -Iinclude -Ibullet-2.73/src -I/usr/include/SDL src/ai.cpp
In file included from include/track_object.h:6,
from include/track.h:17,
from src/ai.cpp:4:
include/collision_detection.h:13:37: error: btBulletCollisionCommon.h: No such file or directory
In file included from include/track_object.h:6,
from include/track.h:17,
from src/ai.cpp:4:
include/collision_detection.h:15: error: ‘btCollisionWorld’ has not been declared
include/collision_detection.h:15: error: expected ‘{’ before ‘RayResultCallback’
include/collision_detection.h:16: error: invalid type in declaration before ‘{’ token
include/collision_detection.h:16: warning: extended initializer lists only available with -std=c++0x or -std=gnu++0x
include/collision_detection.h:17: error: invalid use of incomplete type ‘struct MultipleRayResultCallback’
include/collision_detection.h:15: error: forward declaration of ‘struct MultipleRayResultCallback’
include/collision_detection.h:17: error: expected primary-expression before ‘(’ token
include/collision_detection.h:17: error: expected primary-expression before ‘const’
include/collision_detection.h:17: error: expected primary-expression before ‘const’
include/collision_detection.h:17: error: expected ‘}’ before ‘:’ token
include/collision_detection.h:17: error: expected ‘,’ or ‘;’ before ‘:’ token
In file included from include/track_object.h:6,
from include/track.h:17,
from src/ai.cpp:4:
include/collision_detection.h:18: error: ‘btVector3’ does not name a type
include/collision_detection.h:19: error: ‘btVector3’ does not name a type
include/collision_detection.h:21: error: ‘btCollisionWorld’ was not declared in this scope
include/collision_detection.h:21: error: template argument 1 is invalid
include/collision_detection.h:21: error: template argument 2 is invalid
include/collision_detection.h:21: error: invalid type in declaration before ‘;’ token
include/collision_detection.h:23: error: ‘btScalar’ does not name a type
include/collision_detection.h:36: error: expected declaration before ‘}’ token
scons: *** [build/ai.o] Error 1
scons: building terminated because of errors.
johannlp@kamy:~/vdrift-2009-02-15$

Agradezco de antemano en lo que me puedan orientar
Reply


Messages In This Thread
Como instalar Vdrift en Ubuntu 10.04?? - by johannlp - 09-23-2010, 10:27 AM
[No subject] - by NaN - 09-23-2010, 02:57 PM
[No subject] - by skankerror - 09-23-2010, 03:23 PM

Forum Jump:


Users browsing this thread: 1 Guest(s)